{"text_format":"1","workbook":"xlsx","n_sheets":10,"sheets":["はじめに","著作権について","調査票入力シート","学校一覧","集計表１","集計表２","集計表３","集計表４","集計表５","ErrorLog"],"not_rendered":{"charts":0,"images":0,"macros":1,"external_links":0,"defined_names":8,"comments":0,"pivot_tables":0},"unopened":[],"bounds":{"document_bytes":16777216,"sheet_cells":100000,"rows_first":2000,"rows_last":500,"rows_between":2000,"halvings":0,"cell_chars":16384,"cell_head_chars":4096},"cells_cut":0,"cells_raw":0,"read":"whole","date_system":"1900"}

{"sheet":"はじめに","index":0,"n_rows":47,"n_cols":4,"rows_kept":47,"cut":false,"hidden":true,"merged":[[10,1,10,38],[4,0,4,38],[5,1,5,38],[6,1,6,38],[8,0,8,38],[9,1,9,38],[22,0,22,38],[12,1,12,38],[15,3,15,38],[16,3,16,38],[17,3,17,38],[18,3,18,38],[20,3,20,38]]}
[1.44]
[]
[]
[]
["１　ひょうご教育アンケートシステムとは"]
[null,"　電子データ入力によるアンケート調査等の際に、これまで自動集計が困難であった数式を伴う表形式の調査や、複数回答などの回答形式が混在する複雑な調査において、自動集計に対応した定型的な調査様式を簡単に作成するとともに、調査後の自動集計までを短時間で行うことができます。"]
[null,"※集計したいセルを着色するだけで、表形式(Hyo)を含めて最大５種類を同時に分類・集計できます。"]
[]
["２　システムの構成"]
[null,"Hyo5式自動集計システムは次の(１)(２)のツールから構成されます。"]
[null,"(１)自動集計に対応した調査様式を作成する「調査様式作成ツール(HiYoko)」"]
[null,null,null,"→このファイルは「調査様式作成ツール(HiYoko)」です"]
[null,"(２)回答内容を自動で集計・個票印刷するための「自動集計ツール(TamaGo)」"]
[]
[null,null,"○調査実施機関のメリット"]
[null,null,null,"　従来と同様に調査様式をExcelで作成し、集計箇所を着色するだけで、自動集計に対応した調査様式へワンクリックで変換することができます。"]
[null,null,null,"　回答を１つのフォルダにまとめて保管するだけで簡単に自動集計できます。また、指定外の様式で提出されたファイルは特定のフォルダにまとめられるため、問い合わせや再提出のための対象者の抽出を容易に行えます。"]
[null,null,null,"　あらかじめ、個票の印刷範囲を指定しておくことで、個票を連続して自動印刷することができます。"]
[null,null,null,"　共通の組織コードを利用するため、並べ替えや地域別・校種別などのデータ分析を円滑に行うことができます。"]
[null,null,"○回答者のメリット"]
[null,null,null,"　組織全体の調査様式が標準化され、回答方法まで統一されることで、回答者がその操作に習熟し、調査への回答ミスを防止できます。"]
[]
[]
[]
[]
[]
[]
[]
[]
[]
[]
[]
[null,null,"※シートの名前や順番を変えない"]
[]
[null,null,"”設定項目”シートで、集計表１～５にそれぞれ表示させる値ごとの色分類を設定する"]
[null,null,"※基礎データ入力欄に設定された色は使わない⇒この色"]
[null,null,"※それぞれの色づけセルの数は、最大16376までに収めること"]
[]
[null,null,"”調査票入力シート”の該当部分に調査内容を作成し、集計表に表示させる値（最大５種類）のセルに、設定項目シートで設定した塗りつぶしの色をつける"]
[null,null,"※調査項目の数値の入力はまだしない"]
[]
[null,null,"”設定項目”シートにあるコマンドボタン「スタート」をクリックすると、集計表１～５の１行目に色のついたセルのセル番地（K12など）が、３行目にそのセルのリンクコピーが貼り付けられる"]
[null,null,"※１～７列目には、基礎データ入力欄の項目と値へのリンクが貼り付けられる"]
[]
[null,null,"実際の調査データを”調査票入力シート”の色つきセルに入力する"]
[]
[null,null,"”設定項目”シートにあるコマンドボタン「集計表出力」をクリックすると、調査票入力シート・学校一覧・集計表１～５のシートのみがマクロなしで保存される"]

{"sheet":"著作権について","index":1,"n_rows":14,"n_cols":2,"rows_kept":14,"cut":false,"hidden":true,"merged":[]}
[]
[null,"ひょうご教育アンケートシステムの著作権についての注意書き"]
[]
["○","ひょうご教育アンケートシステムシリーズの著作権は，兵庫県立教育研修所および，村中利章・小薮容子が所有します。"]
[]
["○","ひょうご教育アンケートシステムはGPLv2以降のライセンスに基づいています。"]
[]
["○","ひょうご教育アンケートシステムは無保証です。ひょうご教育アンケートシステムを使用することによって生じる、いかなる直接的・間接的損害についても著作者はその責任を負いません。"]
[]
["○","ひょうご教育アンケートシステム内のコードを複写・変更して，新しいプログラムを作り，使用することは自由です。またコードを複写・変更したプログラムを不特定多数に再配布しても構いません。"]
[]
["○","ただし再配布の場合は，著作権者である兵庫県立教育委研修所および，村中利章・小薮容子の名称とひょうご教育アンケートシステムのサイトのURLの表記，そしてソースコードを閲覧可能とすること，変更箇所のソースコードの公開を義務とします。また，再配布したプログラムはひょうご教育アンケートシステムと同様に，第三者への利用が自由であることを義務とします。"]
[]
[null,"©2016兵庫県立教育研修所・村中利章・小薮容子"]

{"sheet":"調査票入力シート","index":2,"n_rows":14,"n_cols":146,"rows_kept":14,"cut":false,"hidden":false,"merged":[[13,41,13,43],[13,44,13,58],[9,13,9,51],[11,3,11,8],[11,9,11,14],[11,15,11,22],[11,23,11,40],[13,23,13,28],[13,29,13,40],[12,3,13,8],[12,9,13,14],[12,15,13,22],[12,23,12,28],[12,29,12,40],[1,62,4,87],[1,89,1,95],[11,41,11,58],[12,41,12,48],[12,50,12,58],[3,53,4,55],[8,50,8,51],[8,53,8,54],[8,56,8,57],[7,48,7,58],[1,3,4,8],[1,9,2,20],[1,21,2,31],[1,32,1,49],[1,50,1,58],[2,32,2,40],[2,41,2,49],[2,50,2,52],[2,53,2,55],[3,56,4,58],[2,56,2,58],[3,9,4,20],[3,21,4,31],[3,32,4,40],[3,41,4,49],[3,50,4,52],[8,3,8,9],[1,145,1,151],[2,89,3,95],[2,97,3,103],[2,105,3,111],[2,113,3,119],[2,121,3,127],[2,129,3,135],[2,137,3,143],[2,145,3,151],[1,113,1,119],[1,121,1,127],[1,129,1,135],[1,137,1,143],[1,97,1,103],[1,105,1,111]]}
[]
[null,null,null,"基礎データ\n入　力　欄",null,null,null,null,null,"所属コード",null,null,null,null,null,null,null,null,null,null,null,"校長名",null,null,null,null,null,null,null,null,null,null,"記入者",null,null,null,null,null,null,null,null,null,null,null,null,null,null,null,null,null,"提出年月日",null,null,null,null,null,null,null,null,null,null,null,"○調査ファイル出力ボタンを押す前に印刷範囲の設定を行ってください。\n※最初に用紙サイズ、印刷方向、印刷範囲、ページ区切りを設定することを推奨します。\n○アンケート・調査票はこのラインから下の印刷範囲内で作成してください。",null,null,null,null,null,null,null,null,null,null,null,null,null,null,null,null,null,null,null,null,null,null,null,null,null,null,"整列番号",null,null,null,null,null,null,null,"所管コード",null,null,null,null,null,null,null,"教委コード",null,null,null,null,null,null,null,"校区分コード",null,null,null,null,null,null,null,"予備１",null,null,null,null,null,null,null,"予備２",null,null,null,null,null,null,null,"予備３",null,null,null,null,null,null,null,"予備４"]
[null,null,null,null,null,null,null,null,null,null,null,null,null,null,null,null,null,null,null,null,null,null,null,null,null,null,null,null,null,null,null,null,"職名",null,null,null,null,null,null,null,null,"名前",null,null,null,null,null,null,null,null,"年",null,null,"月",null,null,"日",null,null,null,null,null,null,null,null,null,null,null,null,null,null,null,null,null,null,null,null,null,null,null,null,null,null,null,null,null,null,null,null,{"$f":"IF($J$4=\"\",\"\",VLOOKUP($J$4,学校一覧!$A$2:$R1498,12,FALSE))","v":""},null,null,null,null,null,null,null,{"$f":"IF($J$4=\"\",\"\",VLOOKUP($J$4,学校一覧!$A$2:$R1498,3,FALSE))","v":""},null,null,null,null,null,null,null,{"$f":"IF($J$4=\"\",\"\",VLOOKUP($J$4,学校一覧!$A$2:$R1498,5,FALSE))","v":""},null,null,null,null,null,null,null,{"$f":"IF($J$4=\"\",\"\",VLOOKUP($J$4,学校一覧!$A$2:$R1498,9,FALSE))","v":""},null,null,null,null,null,null,null,{"$f":"IF($J$4=\"\",\"\",VLOOKUP($J$4,学校一覧!$A$2:$R1498,15,FALSE))","v":""},null,null,null,null,null,null,null,{"$f":"IF($J$4=\"\",\"\",VLOOKUP($J$4,学校一覧!$A$2:$R1498,16,FALSE))","v":""},null,null,null,null,null,null,null,{"$f":"IF($J$4=\"\",\"\",VLOOKUP($J$4,学校一覧!$A$2:$R1498,17,FALSE))","v":""},null,null,null,null,null,null,null,{"$f":"IF($J$4=\"\",\"\",VLOOKUP($J$4,学校一覧!$A$2:$R1498,18,FALSE))","v":""}]
[]
[]
[]
[null,{"$f":"IF(J4=\"\",\"\",VLOOKUP(J4,学校一覧!$A$2:$N$1498,11,FALSE))&\" \"&IF(J4=\"\",\"\",VLOOKUP(J4,学校一覧!$A$2:$N$1498,2,FALSE))","v":" "}]
[null,null,"別紙様式",null,null,null,null,null,null,null,null,null,null,null,null,null,null,null,null,null,null,null,null,null,null,null,null,null,null,null,null,null,null,null,null,null,null,null,null,null,null,null,null,null,null,null,null,null,"（電子メール施行）"]
[null,null,null,"【提出先を設定】",null,null,null,null,null,null,null,null,null,null,null,null,null,null,null,null,null,null,null,null,null,null,null,null,null,null,null,null,null,null,null,null,null,null,null,null,null,null,null,null,null,null,null,null,"令和",null,{"$f":"IF(AY4=\"\",\"\",AY4)","v":""},null,"年",{"$f":"IF(BB4=\"\",\"\",BB4)","v":""},null,"月末現在",{"$f":"IF(BE4=\"\",\"\",BE4)","v":""},null,"日"]
[null,null,null,null,null,null,null,null,null,null,null,null,null,"【調査タイトル入力枠】…この文字を消して入力してください。"]
[]
[null,null,null,"整理番号",null,null,null,null,null,"課程別",null,null,null,null,null,"本校・分校別",null,null,null,null,null,null,null,"学校名・校長名（分校名等）",null,null,null,null,null,null,null,null,null,null,null,null,null,null,null,null,null,"記入者　職名・名前・連絡先"]
[null,null,null,{"$f":"IF(J4=\"\",\"\",IF(VLOOKUP(J4,学校一覧!$A$2:$R$1498,11,FALSE)=\"\",\"****\",VLOOKUP(J4,学校一覧!$A$2:$R$1498,11,FALSE)))","v":""},null,null,null,null,null,{"$f":"IF(J4=\"\",\"\",IF(VLOOKUP(J4,学校一覧!$A$2:$R$1498,13,FALSE)=\"\",\"****\",VLOOKUP(J4,学校一覧!$A$2:$R$1498,13,FALSE)))","v":""},null,null,null,null,null,{"$f":"IF(J4=\"\",\"\",IF(VLOOKUP(J4,学校一覧!$A$2:$R$1498,14,FALSE)=\"\",\"****\",VLOOKUP(J4,学校一覧!$A$2:$R$1498,14,FALSE)))","v":""},null,null,null,null,null,null,null,"学校名",null,null,null,null,null,{"$f":"IF(J4=\"\",\"\",VLOOKUP(J4,学校一覧!$A$2:$R$1498,2,FALSE))","v":""},null,null,null,null,null,null,null,null,null,null,null,{"$f":"IF(AG4=\"\",\"****\",AG4)","v":"****"},null,null,null,null,null,null,null,"・",{"$f":"IF(AP4=\"\",\"\",AP4)","v":""}]
[null,null,null,null,null,null,null,null,null,null,null,null,null,null,null,null,null,null,null,null,null,null,null,"校長名",null,null,null,null,null,{"$f":"IF(V4=\"\",\"****\",V4)","v":"****"},null,null,null,null,null,null,null,null,null,null,null,"　TEL",null,null,{"$f":"IF(J4=\"\",\"\",IF(VLOOKUP(J4,学校一覧!A2:R$1498,7,FALSE)=\"\",\"****\",VLOOKUP(J4,学校一覧!A2:R$1498,7,FALSE)))","v":""}]

{"sheet":"学校一覧","index":3,"n_rows":1402,"n_cols":18,"rows_kept":1402,"cut":false,"hidden":false,"merged":[]}
["所属\nコード","学校名（　）表示あり","所管\nコード","所管\n略称","教委\nコード","教委\n略称","電話番号","FAX番号","校区分\nコード","校区分\n略称","整理番号","整列番号","課程","本・分校","予備１","予備２","予備３","予備４"]
[120614,"兵庫県立大学附属高等学校",11,"県",1,"県","0791-58-0722","0791-58-0723",3,"高",null,null,"全日制","本校"]
[120624,"兵庫県立大学附属中学校",11,"県",1,"県","0791-58-0735","0791-58-0745",2,"中"]
[321001,"兵庫県立御影高等学校",11,"県",1,"県","078-841-1501","078-841-1503",3,"高",null,null,"全日制","本校"]
[321003,"兵庫県立東灘高等学校",11,"県",1,"県","078-452-9600","078-452-9601",3,"高",null,null,"全日制","本校"]
[321006,"兵庫県立神戸高等学校",11,"県",1,"県","078-861-0434","078-861-0436",3,"高",null,null,"全日制","本校"]
[321016,"兵庫県立夢野台高等学校",11,"県",1,"県","078-691-1546","078-691-1548",3,"高",null,null,"全日制","本校"]
[321021,"兵庫県立兵庫高等学校",11,"県",1,"県","078-691-1135","078-691-1136",3,"高",null,null,"全日制","本校"]
[321025,"兵庫県立神戸鈴蘭台高等学校",11,"県",1,"県","078-591-1331","078-591-1332",3,"高",null,null,"全日制","本校"]
[321029,"兵庫県立神戸北高等学校",11,"県",1,"県","078-981-0131","078-981-0132",3,"高",null,null,"全日制","本校"]
[321030,"兵庫県立神戸甲北高等学校",11,"県",1,"県","078-593-7291","078-593-7293",3,"高",null,null,"全日制","本校"]
[321031,"兵庫県立湊川高等学校",11,"県",1,"県","078-691-7406","078-691-7406",3,"高",null,null,"定時制","本校"]
[321036,"兵庫県立長田高等学校",11,"県",1,"県","078-621-4101","078-621-4102",3,"高",null,null,"全日制","本校"]
[321039,"兵庫県立須磨友が丘高等学校",11,"県",1,"県","078-791-7881","078-791-7882",3,"高",null,null,"全日制","本校"]
[321040,"兵庫県立須磨東高等学校",11,"県",1,"県","078-793-1616","078-793-1617",3,"高",null,null,"全日制","本校"]
[321041,"兵庫県立星陵高等学校",11,"県",1,"県","078-707-6565","078-707-6589",3,"高",null,null,"全日制","本校"]
[321042,"兵庫県立舞子高等学校",11,"県",1,"県","078-783-5151","078-783-5152",3,"高",null,null,"全日制","本校"]
[321043,"兵庫県立北須磨高等学校",11,"県",1,"県","078-792-7661","078-792-7662",3,"高",null,null,"全日制","本校"]
[321044,"兵庫県立伊川谷高等学校",11,"県",1,"県","078-974-5630","078-974-5631",3,"高",null,null,"全日制","本校"]
[321045,"兵庫県立神戸高塚高等学校",11,"県",1,"県","078-992-7000","078-992-7002",3,"高",null,null,"全日制","本校"]
[321046,"兵庫県立兵庫工業高等学校",11,"県",1,"県","078-671-1431","078-671-1435",3,"高",null,null,"全日制","本校"]
[321047,"兵庫県立伊川谷北高等学校",11,"県",1,"県","078-792-6902","078-792-6903",3,"高",null,null,"全日制","本校"]
[321051,"兵庫県立神戸工業高等学校",11,"県",1,"県","078-651-2811","078-651-2812",3,"高",null,null,"定時制","本校"]
[321056,"兵庫県立長田商業高等学校",11,"県",1,"県","078-631-0616","078-631-0617",3,"高",null,null,"定時制","本校"]
[321061,"兵庫県立青雲高等学校",11,"県",1,"県","078-641-4200","078-631-9058",3,"高",null,null,"通信制","本校"]
[321066,"兵庫県立神戸商業高等学校",11,"県",1,"県","078-707-6464","078-707-6466",3,"高",null,null,"全日制","本校"]
[321501,"神戸市立葺合高等学校",31,"神戸市",1300,"神戸市","078-291-0771","078-271-5614",3,"高",null,null,"全日制","本校"]
[321502,"神戸市立科学技術高等学校",31,"神戸市",1300,"神戸市","078-272-9900","078-272-9919",3,"高",null,null,"全日制","本校"]
[321511,"神戸市立神港橘高等学校",31,"神戸市",1300,"神戸市","078-579-2000","078-579-2030",3,"高",null,null,"全日制","本校"]
[321522,"神戸市立須磨翔風高等学校",31,"神戸市",1300,"神戸市","078-798-4155","078-798-0478",3,"高",null,null,"全日制","本校"]
[321541,"神戸市立摩耶兵庫高等学校",31,"神戸市",1300,"神戸市","078-360-1316","078-360-1318",3,"高",null,null,"定時制","本校"]
[321546,"神戸市立楠高等学校",31,"神戸市",1300,"神戸市","078-521-4700","078-521-6450",3,"高",null,null,"定時制","本校"]
[321552,"神戸市立神戸工科高等学校",31,"神戸市",1300,"神戸市","078-272-9910","078-272-9929",3,"高",null,null,"定時制","本校"]
[321571,"神戸市立六甲アイランド高等学校",31,"神戸市",1300,"神戸市","078-858-4000","078-858-0145",3,"高",null,null,"全日制","本校"]
[322001,"兵庫県立尼崎高等学校",11,"県",1,"県","06-6401-0643","06-6401-0645",3,"高",null,null,"全日制","本校"]
[322006,"兵庫県立尼崎北高等学校",11,"県",1,"県","06-6421-0132","06-6421-0154",3,"高",null,null,"全日制","本校"]
[322011,"兵庫県立尼崎西高等学校",11,"県",1,"県","06-6417-5021","06-6417-5023",3,"高",null,null,"全日制","本校"]
[322013,"兵庫県立尼崎小田高等学校",11,"県",1,"県","06-6488-5335","06-6488-5337",3,"高",null,null,"全日制","本校"]
[322015,"兵庫県立尼崎稲園高等学校",11,"県",1,"県","06-6422-0271","06-6422-0272",3,"高",null,null,"全日制","本校"]
[322016,"兵庫県立尼崎工業高等学校",11,"県",1,"県","06-6481-4841","06-6481-4843",3,"高",null,null,"全日制","本校"]
[322021,"兵庫県立神崎工業高等学校",11,"県",1,"県","06-6481-5503","06-6481-5708",3,"高",null,null,"定時制","本校"]
[322027,"兵庫県立武庫荘総合高等学校",11,"県",1,"県","06-6431-5520","06-6431-1858",3,"高",null,null,"全日制","本校"]
[322031,"兵庫県立西宮高等学校",11,"県",1,"県","0798-52-0185","0798-52-0187",3,"高",null,null,"全日制","本校"]
[322032,"兵庫県立西宮香風高等学校",11,"県",1,"県","0798-39-1017","0798-39-1018",3,"高",null,null,"多部制","本校"]
[322036,"兵庫県立鳴尾高等学校",11,"県",1,"県","0798-47-1324","0798-47-1326",3,"高",null,null,"全日制","本校"]
[322037,"兵庫県立西宮今津高等学校",11,"県",1,"県","0798-45-1941","0798-45-1942",3,"高",null,null,"全日制","本校"]
[322038,"兵庫県立西宮北高等学校",11,"県",1,"県","0798-71-1301","0798-71-1302",3,"高",null,null,"全日制","本校"]
[322039,"兵庫県立西宮南高等学校",11,"県",1,"県","0798-45-2043","0798-45-2056",3,"高",null,null,"全日制","本校"]
[322040,"兵庫県立西宮甲山高等学校",11,"県",1,"県","0798-74-2460","0798-74-2461",3,"高",null,null,"全日制","本校"]
[322041,"兵庫県立芦屋高等学校",11,"県",1,"県","0797-32-2325","0797-32-2327",3,"高",null,null,"全日制","本校"]
[322044,"兵庫県立国際高等学校",11,"県",1,"県","0797-35-5931","0797-35-5932",3,"高",null,null,"全日制","本校"]
[322051,"兵庫県立伊丹高等学校",11,"県",1,"県","072-782-2065","072-782-3349",3,"高",null,null,"全日制","本校"]
[322052,"兵庫県立猪名川高等学校",11,"県",1,"県","072-766-0101","072-766-0103",3,"高",null,null,"全日制","本校"]
[322053,"兵庫県立伊丹北高等学校",11,"県",1,"県","072-779-4651","072-779-4659",3,"高",null,null,"全日制","本校"]
[322054,"兵庫県立伊丹西高等学校",11,"県",1,"県","072-777-3711","072-777-3712",3,"高",null,null,"全日制","本校"]
[322056,"兵庫県立宝塚高等学校",11,"県",1,"県","0797-71-0345","0797-71-0347",3,"高",null,null,"全日制","本校"]
[322057,"兵庫県立宝塚東高等学校",11,"県",1,"県","0797-89-3751","0797-89-3753",3,"高",null,null,"全日制","本校"]
[322058,"兵庫県立川西緑台高等学校",11,"県",1,"県","072-793-0361","072-793-0520",3,"高",null,null,"全日制","本校"]
[322059,"兵庫県立川西明峰高等学校",11,"県",1,"県","072-757-8826","072-757-8827",3,"高",null,null,"全日制","本校"]
[322060,"兵庫県立川西北陵高等学校",11,"県",1,"県","072-794-7411","072-794-7412",3,"高",null,null,"全日制","本校"]
[322062,"兵庫県立宝塚西高等学校",11,"県",1,"県","0797-73-4035","0797-73-6298",3,"高",null,null,"全日制","本校"]
[322063,"兵庫県立宝塚北高等学校",11,"県",1,"県","0797-86-3291","0797-86-3292",3,"高",null,null,"全日制","本校"]
[322064,"兵庫県立阪神昆陽高等学校",11,"県",1,"県","072-773-5145","072-773-5162",3,"高",null,null,"多部制","本校"]
[322503,"尼崎市立琴ノ浦高等学校",2,"阪神",201,"尼崎市","06-6481-8460","06-6482-5686",3,"高",null,null,"定時制","本校"]
[322521,"尼崎市立尼崎高等学校",2,"阪神",201,"尼崎市","06-6429-0169","06-6429-0177",3,"高",null,null,"全日制","本校"]
[322524,"尼崎市立尼崎双星高等学校",2,"阪神",201,"尼崎市","06-6491-7000","06-6491-7042",3,"高",null,null,"全日制","本校"]
[322531,"西宮市立西宮高等学校",2,"阪神",202,"西宮市","0798-74-6711","0798-74-0938",3,"高",null,null,"全日制","本校"]
[322532,"西宮市立西宮東高等学校",2,"阪神",202,"西宮市","0798-47-6013","0798-40-5469",3,"高",null,null,"全日制","本校"]
[322541,"伊丹市立伊丹高等学校",2,"阪神",304,"伊丹市","072-772-2040","072-777-8640",3,"高",null,null,"全日制","本校"]
[323001,"兵庫県立有馬高等学校",11,"県",1,"県","079-563-2881","079-563-2882",3,"高",null,null,"全日制","本校"]
[323001.09999999998,"兵庫県立有馬高等学校（定）",11,"県",1,"県","079-563-2883","079-563-2882",3,"高",null,null,"定時制","本校"]
[323003,"兵庫県立北摂三田高等学校",11,"県",1,"県","079-563-6711","079-563-6712",3,"高",null,null,"全日制","本校"]
[323004,"兵庫県立三田西陵高等学校",11,"県",1,"県","079-565-5287","079-565-5289",3,"高",null,null,"全日制","本校"]
[323005,"兵庫県立三田祥雲館高等学校",11,"県",1,"県","079-560-6080","079-564-6811",3,"高",null,null,"全日制","本校"]
[323006,"兵庫県立柏原高等学校",11,"県",1,"県","0795-72-1166","0795-72-1168",3,"高",null,null,"全日制","本校"]
[323008,"兵庫県立氷上西高等学校",11,"県",1,"県","0795-87-0146","0795-87-1553",3,"高",null,null,"全日制","本校"]
[323011,"兵庫県立氷上高等学校",11,"県",1,"県","0795-74-0104","0795-74-0146",3,"高",null,null,"全日制","本校"]
[323016,"兵庫県立篠山鳳鳴高等学校",11,"県",1,"県","079-552-0047","079-552-0653",3,"高",null,null,"全日制","本校"]
[323021,"兵庫県立篠山産業高等学校",11,"県",1,"県","079-552-1194","079-552-1196",3,"高",null,null,"全日制","本校"]
[323022,"兵庫県立篠山東雲高等学校",11,"県",1,"県","079-557-0039","079-557-1888",3,"高",null,null,"全日制","本校"]
[324001,"兵庫県立明石高等学校",11,"県",1,"県","078-911-4376","078-911-4377",3,"高",null,null,"全日制","本校"]
[324006,"兵庫県立明石南高等学校",11,"県",1,"県","078-923-3617","078-923-3618",3,"高",null,null,"全日制","本校"]
[324008,"兵庫県立明石北高等学校",11,"県",1,"県","078-936-9100","078-936-9101",3,"高",null,null,"全日制","本校"]
[324009,"兵庫県立明石西高等学校",11,"県",1,"県","078-943-3350","078-943-3351",3,"高",null,null,"全日制","本校"]
[324010,"兵庫県立明石清水高等学校",11,"県",1,"県","078-947-1182","078-947-1183",3,"高",null,null,"全日制","本校"]
[324011,"兵庫県立錦城高等学校",11,"県",1,"県","078-928-3749","078-928-3755",3,"高",null,null,"定時制","本校"]
[324012,"兵庫県立明石城西高等学校",11,"県",1,"県","078-936-8495","078-936-8476",3,"高",null,null,"全日制","本校"]
[324014,"兵庫県立加古川北高等学校",11,"県",1,"県","079-426-6511","079-426-7429",3,"高",null,null,"全日制","本校"]
[324016,"兵庫県立加古川東高等学校",11,"県",1,"県","079-424-2726","079-424-5777",3,"高",null,null,"全日制","本校"]
[324021,"兵庫県立加古川西高等学校",11,"県",1,"県","079-424-2400","079-424-5719",3,"高",null,null,"全日制","本校"]
[324022,"兵庫県立加古川南高等学校",11,"県",1,"県","079-421-2373","079-421-2376",3,"高",null,null,"全日制","本校"]
[324026,"兵庫県立農業高等学校",11,"県",1,"県","079-424-3341","079-424-2995",3,"高",null,null,"全日制","本校"]
[324026.09999999998,"兵庫県立農業高等学校（定）",11,"県",1,"県","079-424-2996","079-424-2995",3,"高",null,null,"定時制","本校"]
[324031,"兵庫県立東播工業高等学校",11,"県",1,"県","079-432-6861","079-432-6862",3,"高",null,null,"全日制","本校"]
[324036,"兵庫県立西脇高等学校",11,"県",1,"県","0795-22-3566","0795-22-3567",3,"高",null,null,"全日制","本校"]
[324038,"兵庫県立西脇北高等学校",11,"県",1,"県","0795-22-5850","0795-22-7359",3,"高",null,null,"多部制","本校"]
[324041,"兵庫県立西脇工業高等学校",11,"県",1,"県","0795-22-5506","0795-22-5507",3,"高",null,null,"全日制","本校"]
[324043,"兵庫県立多可高等学校",11,"県",1,"県","0795-32-3214","0795-32-3375",3,"高",null,null,"全日制","本校"]
[324046,"兵庫県立三木高等学校",11,"県",1,"県","0794-82-5001","0794-82-5002",3,"高",null,null,"全日制","本校"]
[324048,"兵庫県立三木北高等学校",11,"県",1,"県","0794-85-6781","0794-85-6985",3,"高",null,null,"全日制","本校"]
[324051,"兵庫県立高砂高等学校",11,"県",1,"県","079-442-2371","079-442-2373",3,"高",null,null,"全日制","本校"]
[324052,"兵庫県立高砂南高等学校",11,"県",1,"県","079-443-5900","079-443-5901",3,"高",null,null,"全日制","本校"]
[324056,"兵庫県立松陽高等学校",11,"県",1,"県","079-447-4021","079-447-4023",3,"高",null,null,"全日制","本校"]
[324056.09999999998,"兵庫県立松陽高等学校（定）",11,"県",1,"県","079-447-4022","079-447-4023",3,"高",null,null,"定時制","本校"]
[324058,"兵庫県立東播磨高等学校",11,"県",1,"県","079-492-3111","079-492-3139",3,"高",null,null,"全日制","本校"]
[324059,"兵庫県立播磨南高等学校",11,"県",1,"県","078-944-1157","078-944-1158",3,"高",null,null,"全日制","本校"]
[324061,"兵庫県立小野高等学校",11,"県",1,"県","0794-63-2007","0794-63-2008",3,"高",null,null,"全日制","本校"]
[324066,"兵庫県立小野工業高等学校",11,"県",1,"県","0794-63-1941","0794-63-1943",3,"高",null,null,"全日制","本校"]
[324066.09999999998,"兵庫県立小野工業高等学校（定）",11,"県",1,"県","0794-63-1942","0794-63-1943",3,"高",null,null,"定時制","本校"]
[324067,"兵庫県立三木東高等学校",11,"県",1,"県","0794-85-8000","0794-85-8001",3,"高",null,null,"全日制","本校"]
[324068,"兵庫県立吉川高等学校",11,"県",1,"県","0794-73-0068","0794-73-0167",3,"高",null,null,"全日制","本校"]
[324071,"兵庫県立社高等学校",11,"県",1,"県","0795-42-2055","0795-42-2056",3,"高",null,null,"全日制","本校"]
[324076,"兵庫県立北条高等学校",11,"県",1,"県","0790-48-2311","0790-48-2312",3,"高",null,null,"全日制","本校"]
[324081,"兵庫県立播磨農業高等学校",11,"県",1,"県","0790-42-1050","0790-42-1052",3,"高",null,null,"全日制","本校"]
[324501,"明石市立明石商業高等学校",4,"播磨東",409,"明石市","078-918-5950","078-918-5951",3,"高",null,null,"全日制","本校"]
[325001,"兵庫県立姫路東高等学校",11,"県",1,"県","079-285-1166","079-285-1167",3,"高",null,null,"全日制","本校"]
[325002,"兵庫県立姫路別所高等学校",11,"県",1,"県","079-253-0755","079-253-0726",3,"高",null,null,"全日制","本校"]
[325003,"兵庫県立姫路北高等学校",11,"県",1,"県","079-281-0118","079-281-0131",3,"高",null,null,"定時制","本校"]
[325006,"兵庫県立姫路西高等学校",11,"県",1,"県","079-281-6621","079-281-6623",3,"高",null,null,"全日制","本校"]
[325016,"兵庫県立姫路南高等学校",11,"県",1,"県","079-236-1835","079-236-3186",3,"高",null,null,"全日制","本校"]
{"$rows_left_out":1283}
{"sheet":"集計表１","index":4,"n_rows":0,"n_cols":0,"rows_kept":0,"cut":false,"hidden":false,"merged":[]}

{"sheet":"集計表２","index":5,"n_rows":0,"n_cols":0,"rows_kept":0,"cut":false,"hidden":false,"merged":[]}

{"sheet":"集計表３","index":6,"n_rows":0,"n_cols":0,"rows_kept":0,"cut":false,"hidden":false,"merged":[]}

{"sheet":"集計表４","index":7,"n_rows":0,"n_cols":0,"rows_kept":0,"cut":false,"hidden":false,"merged":[]}

{"sheet":"集計表５","index":8,"n_rows":0,"n_cols":0,"rows_kept":0,"cut":false,"hidden":false,"merged":[]}

{"sheet":"ErrorLog","index":9,"n_rows":2,"n_cols":7,"rows_kept":2,"cut":false,"hidden":true,"merged":[]}
["発生日時","エラー番号","エラーメッセージ","myWkBk.Name","newWkBk.Name","maxRow","maxCol"]
["2016-10-11T13:09:03",438,"オブジェクトは、このプロパティまたはメソッドをサポートしていません。","調査様式作成ツールver0.0529.xlsm","【調査タイトル入力枠】…この文字を消して入力してください。20161011130857.xlsx",51,60]