{"text_format":"1","workbook":"xlsx","n_sheets":3,"sheets":["入力画面","申込書","処理"],"not_rendered":{"charts":0,"images":1,"macros":1,"external_links":0,"defined_names":2,"comments":1,"pivot_tables":0},"unopened":[],"bounds":{"document_bytes":16777216,"sheet_cells":100000,"rows_first":2000,"rows_last":500,"rows_between":2000,"halvings":0,"cell_chars":16384,"cell_head_chars":4096},"cells_cut":0,"cells_raw":0,"read":"whole","date_system":"1900"}

{"sheet":"入力画面","index":0,"n_rows":52,"n_cols":29,"rows_kept":52,"cut":false,"hidden":false,"merged":[[2,3,2,6],[4,1,4,2],[0,3,0,10],[1,3,1,10],[0,13,0,19],[0,1,0,2],[1,1,1,2],[2,1,2,2],[3,3,3,10],[4,3,4,10],[3,1,3,2],[2,7,2,10],[5,5,5,6],[6,1,6,2],[5,7,5,8],[6,3,6,4],[5,1,5,2],[5,3,5,4]]}
[null,"申込年月日",null,null,null,null,null,null,null,null,null,null,null,"会員番号は『ＪＳＴＡ+８桁』を入力してください。",null,null,null,null,null,null,null,null,null,null,null,null,null,"学校名（正式）","学校名（略称）"]
[null,"学校名",null,null,null,null,null,null,null,null,null,null,"Ｎｏ．","会員番号","姓","名","姓ﾌﾘｶﾞﾅ","名ﾌﾘｶﾞﾅ","学年","ベスト32","姓名","ドロー表示",null,null,null,null,1,"神戸市立工業高等専門学校","神戸高専"]
[null,"学校名（略称）",null,null,null,null,null,"※「高体連登録名」のことです\n　（プログラムに記載する学校名）",null,null,null,null,1,null,null,null,null,null,null,null,{"$f":"IF(O3=\"\",\"\",O3&\"　\"&P3)","v":""},{"$f":"IF(O3=\"\",\"\",IF(COUNTIF($O$3:$O$52,O3)>=2,O3&\"(\"&LEFT(P3,1)&\")\",O3))","v":""},null,null,null,null,2,"神戸大学附属中等教育学校","神大附中等"]
[null,"学校長名",null,null,null,null,null,null,null,null,null,null,2,null,null,null,null,null,null,null,{"$f":"IF(O4=\"\",\"\",O4&\"　\"&P4)","v":""},{"$f":"IF(O4=\"\",\"\",IF(COUNTIF($O$3:$O$52,O4)>=2,O4&\"(\"&LEFT(P4,1)&\")\",O4))","v":""},null,null,null,null,3,"神戸市立六甲アイランド高等学校","六甲アイ"]
[null,"顧問名",null,null,null,null,null,null,null,null,null,null,3,null,null,null,null,null,null,null,"","",null,null,null,null,4,"神戸市立葺合高等学校","葺合"]
[null,"男・女",null,null,null,"団体戦出場",null,null,null,null,null,null,4,null,null,null,null,null,null,null,"","",null,null,null,null,5,"神戸市立須磨翔風高等学校","須磨翔風"]
[null,"顧問会出席",null,null,null,"出席数",null,null,null,null,null,null,5,null,null,null,null,null,null,null,"","",null,null,null,null,6,"神戸市立神港橘高等学校","神港橘"]
[null,null,null,null,null,null,null,null,null,null,null,null,6,null,null,null,null,null,null,null,"","",null,null,null,null,7,"神戸市立科学技術高等学校","神戸科技"]
[null,null,null,null,null,null,null,null,null,null,null,null,7,null,null,null,null,null,null,null,"","",null,null,null,null,8,"兵庫県立東灘高等学校","東灘"]
[null,"「コンテンツを有効化」をクリックして許可をすると下のボタンが利用できます。",null,null,null,null,null,null,null,null,null,null,8,null,null,null,null,null,null,null,"","",null,null,null,null,9,"兵庫県立御影高等学校","御影"]
[null,null,null,null,null,null,null,null,null,null,null,null,9,null,null,null,null,null,null,null,"","",null,null,null,null,10,"兵庫県立神戸高等学校","神戸"]
[null,null,null,null,null,null,null,null,null,null,null,null,10,null,null,null,null,null,null,null,"","",null,null,null,null,11,"兵庫県立神戸北高等学校","神戸北"]
[null,null,null,null,null,null,null,null,null,null,null,null,11,null,null,null,null,null,null,null,"","",null,null,null,null,12,"兵庫県立神戸甲北高等学校","神戸甲北"]
[null,"※新規登録のために会員番号が無い場合は空欄にしておいてください。",null,null,null,null,null,null,null,null,null,null,12,null,null,null,null,null,null,null,"","",null,null,null,null,13,"兵庫県立神戸鈴蘭台高等学校","神戸鈴蘭台"]
[null,null,null,null,null,null,null,null,null,null,null,null,13,null,null,null,null,null,null,null,"","",null,null,null,null,14,"兵庫県立夢野台高等学校","夢野台"]
[null,null,null,null,null,null,null,null,null,null,null,null,14,null,null,null,null,null,null,null,"","",null,null,null,null,15,"兵庫県立兵庫高等学校","兵庫"]
[null,null,null,null,null,null,null,null,null,null,null,null,15,null,null,null,null,null,null,null,"","",null,null,null,null,16,"兵庫県立長田高等学校","長田"]
[null,null,null,null,null,null,null,null,null,null,null,null,16,null,null,null,null,null,null,null,"","",null,null,null,null,17,"兵庫県立伊川谷北高等学校","伊川谷北"]
[null,null,null,null,null,null,null,null,null,null,null,null,17,null,null,null,null,null,null,null,"","",null,null,null,null,18,"兵庫県立伊川谷高等学校","伊川谷"]
[null,null,null,null,null,null,null,null,null,null,null,null,18,null,null,null,null,null,null,null,"","",null,null,null,null,19,"兵庫県立神戸高塚高等学校","神戸高塚"]
{"$rows_left_out":33}
{"sheet":"申込書","index":1,"n_rows":39,"n_cols":31,"rows_kept":39,"cut":false,"hidden":false,"merged":[[31,29,31,30],[0,16,0,19],[3,13,3,23],[4,18,4,22],[5,18,5,22],[19,29,20,29],[21,29,22,29],[23,29,24,29],[25,29,26,29],[27,29,28,29],[29,29,30,29],[13,26,14,26],[13,27,14,27],[13,29,14,29],[13,30,14,30],[15,29,16,29],[17,29,18,29],[27,26,28,26],[29,26,30,26],[31,26,32,26],[32,15,32,18],[32,19,32,22],[29,19,29,22],[29,23,29,24],[33,26,34,26],[35,26,36,26],[37,26,38,26],[15,26,16,26],[17,26,18,26],[19,26,20,26],[21,26,22,26],[23,26,24,26],[25,26,26,26],[37,23,37,24],[38,3,38,6],[38,7,38,10],[38,11,38,12],[38,15,38,18],[38,19,38,22],[38,23,38,24],[37,1,38,1],[37,3,37,6],[37,7,37,10],[37,11,37,12],[37,15,37,18],[37,19,37,22],[35,23,35,24],[36,3,36,6],[36,7,36,10],[36,11,36,12],[36,15,36,18],[36,19,36,22],[36,23,36,24],[34,11,34,12],[34,15,34,18],[34,19,34,22],[34,23,34,24],[35,1,36,1],[35,3,35,6],[35,7,35,10],[35,11,35,12],[35,15,35,18],[35,19,35,22],[32,23,32,24],[33,1,34,1],[33,3,33,6],[33,7,33,10],[33,11,33,12],[33,15,33,18],[33,19,33,22],[33,23,33,24],[34,3,34,6],[34,7,34,10],[31,1,32,1],[31,3,31,6],[31,7,31,10],[31,11,31,12],[31,13,31,24],[32,3,32,6],[32,7,32,10],[32,11,32,12],[30,3,30,6],[30,7,30,10],[30,11,30,12],[30,15,30,18],[30,19,30,22],[30,23,30,24],[29,1,30,1],[29,3,29,6],[29,7,29,10],[29,11,29,12],[29,13,30,13],[29,15,29,18],[27,19,27,22],[27,23,27,24],[28,3,28,6],[28,7,28,10],[28,11,28,12],[28,15,28,18],[28,19,28,22],[28,23,28,24],[27,1,28,1],[27,3,27,6],[27,7,27,10],[27,11,27,12],[27,13,28,13],[27,15,27,18],[25,19,25,22],[25,23,25,24],[26,3,26,6],[26,7,26,10],[26,11,26,12],[26,15,26,18],[26,19,26,22],[26,23,26,24],[25,1,26,1],[25,3,25,6],[25,7,25,10],[25,11,25,12],[25,13,26,13],[25,15,25,18],[23,19,23,22],[23,23,23,24],[24,3,24,6],[24,7,24,10],[24,11,24,12],[24,15,24,18],[24,19,24,22],[24,23,24,24],[23,1,24,1],[23,3,23,6],[23,7,23,10],[23,11,23,12],[23,13,24,13],[23,15,23,18],[21,19,21,22],[21,23,21,24],[22,3,22,6],[22,7,22,10],[22,11,22,12],[22,15,22,18],[22,19,22,22],[22,23,22,24],[21,1,22,1],[21,3,21,6],[21,7,21,10],[21,11,21,12],[21,13,22,13],[21,15,21,18],[19,19,19,22],[19,23,19,24],[20,3,20,6],[20,7,20,10],[20,11,20,12],[20,15,20,18],[20,19,20,22],[20,23,20,24],[19,1,20,1],[19,3,19,6],[19,7,19,10],[19,11,19,12],[19,13,20,13],[19,15,19,18],[17,19,17,22],[17,23,17,24],[18,3,18,6],[18,7,18,10],[18,11,18,12],[18,15,18,18],[18,19,18,22],[18,23,18,24],[17,1,18,1],[17,3,17,6],[17,7,17,10],[17,11,17,12],[17,13,18,13],[17,15,17,18],[15,19,15,22],[15,23,15,24],[16,3,16,6],[16,7,16,10],[16,11,16,12],[16,15,16,18],[16,19,16,22],[16,23,16,24],[15,1,16,1],[15,3,15,6],[15,7,15,10],[15,11,15,12],[15,13,16,13],[15,15,15,18],[2,0,2,24],[6,9,6,24],[7,9,7,24],[11,4,11,24],[13,2,14,6],[13,7,14,10],[13,11,14,12],[13,14,14,18],[13,19,14,22],[13,23,14,24],[6,0,6,3],[7,0,7,3],[6,4,6,6],[7,4,7,6]]}
[null,null,null,null,null,null,null,null,null,null,null,null,null,null,null,null,{"$f":"IF(入力画面!D1=\"\",\"\",YEAR(入力画面!D1))","v":""},null,null,null,"年",{"$f":"IF(入力画面!D1=\"\",\"\",MONTH(入力画面!D1))","v":""},"月",{"$f":"IF(入力画面!D1=\"\",\"\",DAY(入力画面!D1))","v":""},"日"]
[]
[{"$f":"\"神戸市高等学校ソフトテニス大会申込書（\"&IF(入力画面!D6=\"\",\"　　\",入力画面!D6)&\"）\"","v":"神戸市高等学校ソフトテニス大会申込書（　　）"}]
[null,null,null,null,null,null,null,null,null,null,null,null,"【",{"$f":"IF(入力画面!D2=\"\",\"\",入力画面!D2)","v":""},null,null,null,null,null,null,null,null,null,null,"】"]
[null,null,null,null,null,null,null,null,null,null,null,null,null,null,"【","学校長氏名",null,null,{"$f":"IF(入力画面!D4=\"\",\"\",入力画面!D4)","v":""},null,null,null,null,"印","】"]
[null,null,null,null,null,null,null,null,null,null,null,null,null,null,"【","顧 問 氏 名",null,null,{"$f":"IF(入力画面!D5=\"\",\"\",入力画面!D5)","v":""},null,null,null,null,"印","】"]
["○団体戦参加",null,null,null,{"$f":"\"（\"&IF(入力画面!H6=\"\",\"\",入力画面!H6)&\"）\"","v":"（）"},null,null,null,null,"※団体戦のみ参加の場合は、選手名を右下の欄にご記入ください。"]
["○顧問会出席",null,null,null,{"$f":"\"（\"&IF(入力画面!D7=\"\",\"\",入力画面!D7)&\"）\"","v":"（）"},null,null,null,null,{"$f":"\"※顧問出席人数［\"&IF(入力画面!G7=\"\",\"　　\",入力画面!G7)&\"］名（男女で1名の場合は一方を0名とご記入ください）。\"","v":"※顧問出席人数［　　］名（男女で1名の場合は一方を0名とご記入ください）。"}]
["○個人戦",null,null,"①強いペアから記入してください。"]
[null,null,null,"②昨年度新人大会でベスト32に入った選手は、名前の前に○印を入れてください。"]
[null,null,null,"③会員登録番号を必ず記入してください。"]
[null,null,null,"　","※注：万が一、新入生等で申込締切日に会員登録番号が取得できなかった場合、会員登録番号の欄は空欄で\n　結構です。ただし、顧問会までに必ず登録を行い、顧問会の受付において会員登録番号を記入した申込書\n　をご提出ください。その際、選手、ペア数等の変更はできませんのでご注意ください。\n　　　　"]
[]
[null,"順","名　　前",null,null,null,null,"会員登録番号",null,null,null,"学年",null,"順","名　　前",null,null,null,null,"会員登録番号",null,null,null,"学年",null,null,"ペア\n番号","選手\n番号",null,"ペア\n番号","選手\n番号"]
[null,"位",null,null,null,null,null,null,null,null,null,null,null,"位"]
[null,1,{"$f":"IFERROR(VLOOKUP(AB16,入力画面!$M:$T,8,FALSE),\"\")","v":""},{"$f":"IFERROR(VLOOKUP(AB16,入力画面!$M:$U,9,FALSE),\"\")","v":""},null,null,null,{"$f":"IFERROR(VLOOKUP(AB16,入力画面!$M:$U,2,FALSE),\"\")","v":""},null,null,null,{"$f":"IFERROR(VLOOKUP(AB16,入力画面!$M:$U,7,FALSE),\"\")&\" 年\"","v":" 年"},null,13,{"$f":"IFERROR(VLOOKUP(AE16,入力画面!$M:$U,8,FALSE),\"\")","v":""},{"$f":"IFERROR(VLOOKUP(AE16,入力画面!$M:$U,9,FALSE),\"\")","v":""},null,null,null,{"$f":"IFERROR(VLOOKUP(AE16,入力画面!$M:$U,2,FALSE),\"\")","v":""},null,null,null,{"$f":"IFERROR(VLOOKUP(AE16,入力画面!$M:$U,7,FALSE),\"\")&\" 年\"","v":" 年"},null,null,1,null,null,13]
[null,null,{"$f":"IFERROR(VLOOKUP(AB17,入力画面!$M:$T,8,FALSE),\"\")","v":""},{"$f":"IFERROR(VLOOKUP(AB17,入力画面!$M:$U,9,FALSE),\"\")","v":""},null,null,null,{"$f":"IFERROR(VLOOKUP(AB17,入力画面!$M:$U,2,FALSE),\"\")","v":""},null,null,null,{"$f":"IFERROR(VLOOKUP(AB17,入力画面!$M:$U,7,FALSE),\"\")&\" 年\"","v":" 年"},null,null,{"$f":"IFERROR(VLOOKUP(AE17,入力画面!$M:$U,8,FALSE),\"\")","v":""},{"$f":"IFERROR(VLOOKUP(AE17,入力画面!$M:$U,9,FALSE),\"\")","v":""},null,null,null,{"$f":"IFERROR(VLOOKUP(AE17,入力画面!$M:$U,2,FALSE),\"\")","v":""},null,null,null,{"$f":"IFERROR(VLOOKUP(AE17,入力画面!$M:$U,7,FALSE),\"\")&\" 年\"","v":" 年"}]
[null,2,{"$f":"IFERROR(VLOOKUP(AB18,入力画面!$M:$T,8,FALSE),\"\")","v":""},{"$f":"IFERROR(VLOOKUP(AB18,入力画面!$M:$U,9,FALSE),\"\")","v":""},null,null,null,{"$f":"IFERROR(VLOOKUP(AB18,入力画面!$M:$U,2,FALSE),\"\")","v":""},null,null,null,{"$f":"IFERROR(VLOOKUP(AB18,入力画面!$M:$U,7,FALSE),\"\")&\" 年\"","v":" 年"},null,14,{"$f":"IFERROR(VLOOKUP(AE18,入力画面!$M:$U,8,FALSE),\"\")","v":""},{"$f":"IFERROR(VLOOKUP(AE18,入力画面!$M:$U,9,FALSE),\"\")","v":""},null,null,null,{"$f":"IFERROR(VLOOKUP(AE18,入力画面!$M:$U,2,FALSE),\"\")","v":""},null,null,null,{"$f":"IFERROR(VLOOKUP(AE18,入力画面!$M:$U,7,FALSE),\"\")&\" 年\"","v":" 年"},null,null,2,null,null,14]
[null,null,{"$f":"IFERROR(VLOOKUP(AB19,入力画面!$M:$T,8,FALSE),\"\")","v":""},{"$f":"IFERROR(VLOOKUP(AB19,入力画面!$M:$U,9,FALSE),\"\")","v":""},null,null,null,{"$f":"IFERROR(VLOOKUP(AB19,入力画面!$M:$U,2,FALSE),\"\")","v":""},null,null,null,{"$f":"IFERROR(VLOOKUP(AB19,入力画面!$M:$U,7,FALSE),\"\")&\" 年\"","v":" 年"},null,null,{"$f":"IFERROR(VLOOKUP(AE19,入力画面!$M:$U,8,FALSE),\"\")","v":""},{"$f":"IFERROR(VLOOKUP(AE19,入力画面!$M:$U,9,FALSE),\"\")","v":""},null,null,null,{"$f":"IFERROR(VLOOKUP(AE19,入力画面!$M:$U,2,FALSE),\"\")","v":""},null,null,null,{"$f":"IFERROR(VLOOKUP(AE19,入力画面!$M:$U,7,FALSE),\"\")&\" 年\"","v":" 年"}]
[null,3,{"$f":"IFERROR(VLOOKUP(AB20,入力画面!$M:$T,8,FALSE),\"\")","v":""},{"$f":"IFERROR(VLOOKUP(AB20,入力画面!$M:$U,9,FALSE),\"\")","v":""},null,null,null,{"$f":"IFERROR(VLOOKUP(AB20,入力画面!$M:$U,2,FALSE),\"\")","v":""},null,null,null,{"$f":"IFERROR(VLOOKUP(AB20,入力画面!$M:$U,7,FALSE),\"\")&\" 年\"","v":" 年"},null,15,{"$f":"IFERROR(VLOOKUP(AE20,入力画面!$M:$U,8,FALSE),\"\")","v":""},{"$f":"IFERROR(VLOOKUP(AE20,入力画面!$M:$U,9,FALSE),\"\")","v":""},null,null,null,{"$f":"IFERROR(VLOOKUP(AE20,入力画面!$M:$U,2,FALSE),\"\")","v":""},null,null,null,{"$f":"IFERROR(VLOOKUP(AE20,入力画面!$M:$U,7,FALSE),\"\")&\" 年\"","v":" 年"},null,null,3,null,null,15]
{"$rows_left_out":20}
{"sheet":"処理","index":2,"n_rows":23,"n_cols":18,"rows_kept":23,"cut":false,"hidden":true,"merged":[]}
["各校番手","抽選","選手１","選手２","学校名","各校ペア数","選手１番号","選手２番号"]
[{"$f":"IF(AND(INDIRECT(\"申込書!\"&O2,TRUE)<>\"\",INDIRECT(\"申込書!\"&P2,TRUE)),1,\"\")","v":""},null,{"$f":"IFERROR(VLOOKUP(INDIRECT(\"申込書!\"&Q2,TRUE),入力画面!$M:$W,10,FALSE),\"\")","v":""},{"$f":"IFERROR(VLOOKUP(INDIRECT(\"申込書!\"&R2,TRUE),入力画面!$M:$W,10,FALSE),\"\")","v":""},{"$f":"IF(A2<>\"\",入力画面!$D$3,\"\")","v":""},{"$f":"IF(A2<>\"\",MAX($A$2:$A$21),\"\")","v":""},{"$f":"IFERROR(VLOOKUP(INDIRECT(\"申込書!\"&Q2,TRUE),入力画面!$M:$W,2,FALSE),\"\")","v":""},{"$f":"IFERROR(VLOOKUP(INDIRECT(\"申込書!\"&R2,TRUE),入力画面!$M:$W,2,FALSE),\"\")","v":""},null,null,null,null,null,null,"D16","D17","AB16","AB17"]
[{"$f":"IF(AND(INDIRECT(\"申込書!\"&O3,TRUE)<>\"\",INDIRECT(\"申込書!\"&P3,TRUE)),A2+1,\"\")","v":""},null,{"$f":"IFERROR(VLOOKUP(INDIRECT(\"申込書!\"&Q3,TRUE),入力画面!$M:$W,10,FALSE),\"\")","v":""},{"$f":"IFERROR(VLOOKUP(INDIRECT(\"申込書!\"&R3,TRUE),入力画面!$M:$W,10,FALSE),\"\")","v":""},{"$f":"IF(A3<>\"\",入力画面!$D$3,\"\")","v":""},null,{"$f":"IFERROR(VLOOKUP(INDIRECT(\"申込書!\"&Q3,TRUE),入力画面!$M:$W,2,FALSE),\"\")","v":""},{"$f":"IFERROR(VLOOKUP(INDIRECT(\"申込書!\"&R3,TRUE),入力画面!$M:$W,2,FALSE),\"\")","v":""},null,null,null,null,null,null,"D18","D19","AB18","AB19"]
["",null,{"$f":"IFERROR(VLOOKUP(INDIRECT(\"申込書!\"&Q4,TRUE),入力画面!$M:$W,10,FALSE),\"\")","v":""},{"$f":"IFERROR(VLOOKUP(INDIRECT(\"申込書!\"&R4,TRUE),入力画面!$M:$W,10,FALSE),\"\")","v":""},{"$f":"IF(A4<>\"\",入力画面!$D$3,\"\")","v":""},null,{"$f":"IFERROR(VLOOKUP(INDIRECT(\"申込書!\"&Q4,TRUE),入力画面!$M:$W,2,FALSE),\"\")","v":""},{"$f":"IFERROR(VLOOKUP(INDIRECT(\"申込書!\"&R4,TRUE),入力画面!$M:$W,2,FALSE),\"\")","v":""},null,null,null,null,null,null,"D20","D21","AB20","AB21"]
["",null,{"$f":"IFERROR(VLOOKUP(INDIRECT(\"申込書!\"&Q5,TRUE),入力画面!$M:$W,10,FALSE),\"\")","v":""},{"$f":"IFERROR(VLOOKUP(INDIRECT(\"申込書!\"&R5,TRUE),入力画面!$M:$W,10,FALSE),\"\")","v":""},{"$f":"IF(A5<>\"\",入力画面!$D$3,\"\")","v":""},null,{"$f":"IFERROR(VLOOKUP(INDIRECT(\"申込書!\"&Q5,TRUE),入力画面!$M:$W,2,FALSE),\"\")","v":""},{"$f":"IFERROR(VLOOKUP(INDIRECT(\"申込書!\"&R5,TRUE),入力画面!$M:$W,2,FALSE),\"\")","v":""},null,null,null,null,null,null,"D22","D23","AB22","AB23"]
["",null,{"$f":"IFERROR(VLOOKUP(INDIRECT(\"申込書!\"&Q6,TRUE),入力画面!$M:$W,10,FALSE),\"\")","v":""},{"$f":"IFERROR(VLOOKUP(INDIRECT(\"申込書!\"&R6,TRUE),入力画面!$M:$W,10,FALSE),\"\")","v":""},{"$f":"IF(A6<>\"\",入力画面!$D$3,\"\")","v":""},null,{"$f":"IFERROR(VLOOKUP(INDIRECT(\"申込書!\"&Q6,TRUE),入力画面!$M:$W,2,FALSE),\"\")","v":""},{"$f":"IFERROR(VLOOKUP(INDIRECT(\"申込書!\"&R6,TRUE),入力画面!$M:$W,2,FALSE),\"\")","v":""},null,null,null,null,null,null,"D24","D25","AB24","AB25"]
["",null,{"$f":"IFERROR(VLOOKUP(INDIRECT(\"申込書!\"&Q7,TRUE),入力画面!$M:$W,10,FALSE),\"\")","v":""},{"$f":"IFERROR(VLOOKUP(INDIRECT(\"申込書!\"&R7,TRUE),入力画面!$M:$W,10,FALSE),\"\")","v":""},{"$f":"IF(A7<>\"\",入力画面!$D$3,\"\")","v":""},null,{"$f":"IFERROR(VLOOKUP(INDIRECT(\"申込書!\"&Q7,TRUE),入力画面!$M:$W,2,FALSE),\"\")","v":""},{"$f":"IFERROR(VLOOKUP(INDIRECT(\"申込書!\"&R7,TRUE),入力画面!$M:$W,2,FALSE),\"\")","v":""},null,null,null,null,null,null,"D26","D27","AB26","AB27"]
["",null,{"$f":"IFERROR(VLOOKUP(INDIRECT(\"申込書!\"&Q8,TRUE),入力画面!$M:$W,10,FALSE),\"\")","v":""},{"$f":"IFERROR(VLOOKUP(INDIRECT(\"申込書!\"&R8,TRUE),入力画面!$M:$W,10,FALSE),\"\")","v":""},{"$f":"IF(A8<>\"\",入力画面!$D$3,\"\")","v":""},null,{"$f":"IFERROR(VLOOKUP(INDIRECT(\"申込書!\"&Q8,TRUE),入力画面!$M:$W,2,FALSE),\"\")","v":""},{"$f":"IFERROR(VLOOKUP(INDIRECT(\"申込書!\"&R8,TRUE),入力画面!$M:$W,2,FALSE),\"\")","v":""},null,null,null,null,null,null,"D28","D29","AB28","AB29"]
["",null,{"$f":"IFERROR(VLOOKUP(INDIRECT(\"申込書!\"&Q9,TRUE),入力画面!$M:$W,10,FALSE),\"\")","v":""},{"$f":"IFERROR(VLOOKUP(INDIRECT(\"申込書!\"&R9,TRUE),入力画面!$M:$W,10,FALSE),\"\")","v":""},{"$f":"IF(A9<>\"\",入力画面!$D$3,\"\")","v":""},null,{"$f":"IFERROR(VLOOKUP(INDIRECT(\"申込書!\"&Q9,TRUE),入力画面!$M:$W,2,FALSE),\"\")","v":""},{"$f":"IFERROR(VLOOKUP(INDIRECT(\"申込書!\"&R9,TRUE),入力画面!$M:$W,2,FALSE),\"\")","v":""},null,null,null,null,null,null,"D30","D31","AB30","AB31"]
["",null,{"$f":"IFERROR(VLOOKUP(INDIRECT(\"申込書!\"&Q10,TRUE),入力画面!$M:$W,10,FALSE),\"\")","v":""},{"$f":"IFERROR(VLOOKUP(INDIRECT(\"申込書!\"&R10,TRUE),入力画面!$M:$W,10,FALSE),\"\")","v":""},{"$f":"IF(A10<>\"\",入力画面!$D$3,\"\")","v":""},null,{"$f":"IFERROR(VLOOKUP(INDIRECT(\"申込書!\"&Q10,TRUE),入力画面!$M:$W,2,FALSE),\"\")","v":""},{"$f":"IFERROR(VLOOKUP(INDIRECT(\"申込書!\"&R10,TRUE),入力画面!$M:$W,2,FALSE),\"\")","v":""},null,null,null,null,null,null,"D32","D33","AB32","AB33"]
["",null,{"$f":"IFERROR(VLOOKUP(INDIRECT(\"申込書!\"&Q11,TRUE),入力画面!$M:$W,10,FALSE),\"\")","v":""},{"$f":"IFERROR(VLOOKUP(INDIRECT(\"申込書!\"&R11,TRUE),入力画面!$M:$W,10,FALSE),\"\")","v":""},{"$f":"IF(A11<>\"\",入力画面!$D$3,\"\")","v":""},null,{"$f":"IFERROR(VLOOKUP(INDIRECT(\"申込書!\"&Q11,TRUE),入力画面!$M:$W,2,FALSE),\"\")","v":""},{"$f":"IFERROR(VLOOKUP(INDIRECT(\"申込書!\"&R11,TRUE),入力画面!$M:$W,2,FALSE),\"\")","v":""},null,null,null,null,null,null,"D34","D35","AB34","AB35"]
["",null,{"$f":"IFERROR(VLOOKUP(INDIRECT(\"申込書!\"&Q12,TRUE),入力画面!$M:$W,10,FALSE),\"\")","v":""},{"$f":"IFERROR(VLOOKUP(INDIRECT(\"申込書!\"&R12,TRUE),入力画面!$M:$W,10,FALSE),\"\")","v":""},{"$f":"IF(A12<>\"\",入力画面!$D$3,\"\")","v":""},null,{"$f":"IFERROR(VLOOKUP(INDIRECT(\"申込書!\"&Q12,TRUE),入力画面!$M:$W,2,FALSE),\"\")","v":""},{"$f":"IFERROR(VLOOKUP(INDIRECT(\"申込書!\"&R12,TRUE),入力画面!$M:$W,2,FALSE),\"\")","v":""},null,null,null,null,null,null,"D36","D37","AB36","AB37"]
["",null,{"$f":"IFERROR(VLOOKUP(INDIRECT(\"申込書!\"&Q13,TRUE),入力画面!$M:$W,10,FALSE),\"\")","v":""},{"$f":"IFERROR(VLOOKUP(INDIRECT(\"申込書!\"&R13,TRUE),入力画面!$M:$W,10,FALSE),\"\")","v":""},{"$f":"IF(A13<>\"\",入力画面!$D$3,\"\")","v":""},null,{"$f":"IFERROR(VLOOKUP(INDIRECT(\"申込書!\"&Q13,TRUE),入力画面!$M:$W,2,FALSE),\"\")","v":""},{"$f":"IFERROR(VLOOKUP(INDIRECT(\"申込書!\"&R13,TRUE),入力画面!$M:$W,2,FALSE),\"\")","v":""},null,null,null,null,null,null,"D38","D39","AB38","AB39"]
["",null,{"$f":"IFERROR(VLOOKUP(INDIRECT(\"申込書!\"&Q14,TRUE),入力画面!$M:$W,10,FALSE),\"\")","v":""},{"$f":"IFERROR(VLOOKUP(INDIRECT(\"申込書!\"&R14,TRUE),入力画面!$M:$W,10,FALSE),\"\")","v":""},{"$f":"IF(A14<>\"\",入力画面!$D$3,\"\")","v":""},null,{"$f":"IFERROR(VLOOKUP(INDIRECT(\"申込書!\"&Q14,TRUE),入力画面!$M:$W,2,FALSE),\"\")","v":""},{"$f":"IFERROR(VLOOKUP(INDIRECT(\"申込書!\"&R14,TRUE),入力画面!$M:$W,2,FALSE),\"\")","v":""},null,null,null,null,null,null,"P16","P17","AE16","AE17"]
["",null,{"$f":"IFERROR(VLOOKUP(INDIRECT(\"申込書!\"&Q15,TRUE),入力画面!$M:$W,10,FALSE),\"\")","v":""},{"$f":"IFERROR(VLOOKUP(INDIRECT(\"申込書!\"&R15,TRUE),入力画面!$M:$W,10,FALSE),\"\")","v":""},{"$f":"IF(A15<>\"\",入力画面!$D$3,\"\")","v":""},null,{"$f":"IFERROR(VLOOKUP(INDIRECT(\"申込書!\"&Q15,TRUE),入力画面!$M:$W,2,FALSE),\"\")","v":""},{"$f":"IFERROR(VLOOKUP(INDIRECT(\"申込書!\"&R15,TRUE),入力画面!$M:$W,2,FALSE),\"\")","v":""},null,null,null,null,null,null,"P18","P19","AE18","AE19"]
["",null,{"$f":"IFERROR(VLOOKUP(INDIRECT(\"申込書!\"&Q16,TRUE),入力画面!$M:$W,10,FALSE),\"\")","v":""},{"$f":"IFERROR(VLOOKUP(INDIRECT(\"申込書!\"&R16,TRUE),入力画面!$M:$W,10,FALSE),\"\")","v":""},{"$f":"IF(A16<>\"\",入力画面!$D$3,\"\")","v":""},null,{"$f":"IFERROR(VLOOKUP(INDIRECT(\"申込書!\"&Q16,TRUE),入力画面!$M:$W,2,FALSE),\"\")","v":""},{"$f":"IFERROR(VLOOKUP(INDIRECT(\"申込書!\"&R16,TRUE),入力画面!$M:$W,2,FALSE),\"\")","v":""},null,null,null,null,null,null,"P20","P21","AE20","AE21"]
["",null,{"$f":"IFERROR(VLOOKUP(INDIRECT(\"申込書!\"&Q17,TRUE),入力画面!$M:$W,10,FALSE),\"\")","v":""},{"$f":"IFERROR(VLOOKUP(INDIRECT(\"申込書!\"&R17,TRUE),入力画面!$M:$W,10,FALSE),\"\")","v":""},{"$f":"IF(A17<>\"\",入力画面!$D$3,\"\")","v":""},null,{"$f":"IFERROR(VLOOKUP(INDIRECT(\"申込書!\"&Q17,TRUE),入力画面!$M:$W,2,FALSE),\"\")","v":""},{"$f":"IFERROR(VLOOKUP(INDIRECT(\"申込書!\"&R17,TRUE),入力画面!$M:$W,2,FALSE),\"\")","v":""},null,null,null,null,null,null,"P22","P23","AE22","AE23"]
["",null,{"$f":"IFERROR(VLOOKUP(INDIRECT(\"申込書!\"&Q18,TRUE),入力画面!$M:$W,10,FALSE),\"\")","v":""},{"$f":"IFERROR(VLOOKUP(INDIRECT(\"申込書!\"&R18,TRUE),入力画面!$M:$W,10,FALSE),\"\")","v":""},{"$f":"IF(A18<>\"\",入力画面!$D$3,\"\")","v":""},null,{"$f":"IFERROR(VLOOKUP(INDIRECT(\"申込書!\"&Q18,TRUE),入力画面!$M:$W,2,FALSE),\"\")","v":""},{"$f":"IFERROR(VLOOKUP(INDIRECT(\"申込書!\"&R18,TRUE),入力画面!$M:$W,2,FALSE),\"\")","v":""},null,null,null,null,null,null,"P24","P25","AE24","AE25"]
["",null,{"$f":"IFERROR(VLOOKUP(INDIRECT(\"申込書!\"&Q19,TRUE),入力画面!$M:$W,10,FALSE),\"\")","v":""},{"$f":"IFERROR(VLOOKUP(INDIRECT(\"申込書!\"&R19,TRUE),入力画面!$M:$W,10,FALSE),\"\")","v":""},{"$f":"IF(A19<>\"\",入力画面!$D$3,\"\")","v":""},null,{"$f":"IFERROR(VLOOKUP(INDIRECT(\"申込書!\"&Q19,TRUE),入力画面!$M:$W,2,FALSE),\"\")","v":""},{"$f":"IFERROR(VLOOKUP(INDIRECT(\"申込書!\"&R19,TRUE),入力画面!$M:$W,2,FALSE),\"\")","v":""},null,null,null,null,null,null,"P26","P27","AE26","AE27"]
["",null,{"$f":"IFERROR(VLOOKUP(INDIRECT(\"申込書!\"&Q20,TRUE),入力画面!$M:$W,10,FALSE),\"\")","v":""},{"$f":"IFERROR(VLOOKUP(INDIRECT(\"申込書!\"&R20,TRUE),入力画面!$M:$W,10,FALSE),\"\")","v":""},{"$f":"IF(A20<>\"\",入力画面!$D$3,\"\")","v":""},null,{"$f":"IFERROR(VLOOKUP(INDIRECT(\"申込書!\"&Q20,TRUE),入力画面!$M:$W,2,FALSE),\"\")","v":""},{"$f":"IFERROR(VLOOKUP(INDIRECT(\"申込書!\"&R20,TRUE),入力画面!$M:$W,2,FALSE),\"\")","v":""},null,null,null,null,null,null,"P28","P29","AE28","AE29"]
{"$rows_left_out":3}